Puppy Linux Discussion Forum Forum Index Puppy Linux Discussion Forum
Puppy HOME page : puppylinux.com
"THE" alternative forum : puppylinux.info
 
 FAQFAQ   SearchSearch   MemberlistMemberlist   UsergroupsUsergroups   RegisterRegister 
 ProfileProfile   Log in to check your private messagesLog in to check your private messages   Log inLog in 

The time now is Sun 24 Mar 2019, 20:10
All times are UTC - 4
 Forum index » Advanced Topics » Additional Software (PETs, n' stuff) » Multimedia
[SOLVED] compiling Opencv in Bionicpup 18.05+17 32 bit
Post new topic   Reply to topic View previous topic :: View next topic
Page 1 of 1 [8 Posts]  
Author Message
rockedge


Joined: 11 Apr 2012
Posts: 1005
Location: Connecticut, United States

PostPosted: Tue 20 Nov 2018, 12:43    Post subject:  [SOLVED] compiling Opencv in Bionicpup 18.05+17 32 bit
Subject description: completes cmake confiig but fails make at 35%
 

Hello everyone! does anyone have any tips on compiling Opencv with Puppy Linux? I have read an old thread and a lot of Ubuntu guides and tracked down error after error and experimented with many many cmake options but to no avail.

here are some short samples of output from the latest attempt using this command ->

Code:
cmake -D INSTALL_C_EXAMPLES=ON -D WITH_WEBP=OFF -D WITH_OPENEXR=OFF -D WITH_IPP=OFF -D WITH_V4L=ON -D WITH_QT=OFF ..



Code:
--     Built as dynamic libs?:      YES
--     C++ Compiler:                /usr/bin/c++  (ver 7.3.0)
--     C++ flags (Release):         -fsigned-char -W -Wall -Werror=return-type -Werror=non-virtual-dtor -Werror=address -Werror=sequence-point -Wformat -Werror=format-security -Wmissing-declarations -Wundef -Winit-self -Wpointer-arith -Wshadow -Wsign-promo -Wuninitialized -Winit-self -Wsuggest-override -Wno-narrowing -Wno-delete-non-virtual-dtor -Wno-comment -Wimplicit-fallthrough=3 -Wno-strict-overflow -fdiagnostics-show-option -pthread -fomit-frame-pointer -ffunction-sections -fdata-sections  -msse -msse2 -mfpmath=sse -fvisibility=hidden -fvisibility-inlines-hidden -O3 -DNDEBUG  -DNDEBUG
--     C++ flags (Debug):           -fsigned-char -W -Wall -Werror=return-type -Werror=non-virtual-dtor -Werror=address -Werror=sequence-point -Wformat -Werror=format-security -Wmissing-declarations -Wundef -Winit-self -Wpointer-arith -Wshadow -Wsign-promo -Wuninitialized -Winit-self -Wsuggest-override -Wno-narrowing -Wno-delete-non-virtual-dtor -Wno-comment -Wimplicit-fallthrough=3 -Wno-strict-overflow -fdiagnostics-show-option -pthread -fomit-frame-pointer -ffunction-sections -fdata-sections  -msse -msse2 -mfpmath=sse -fvisibility=hidden -fvisibility-inlines-hidden -g  -O0 -DDEBUG -D_DEBUG
--     C Compiler:                  /usr/bin/cc
--     C flags (Release):           -fsigned-char -W -Wall -Werror=return-type -Werror=non-virtual-dtor -Werror=address -Werror=sequence-point -Wformat -Werror=format-security -Wmissing-declarations -Wmissing-prototypes -Wstrict-prototypes -Wundef -Winit-self -Wpointer-arith -Wshadow -Wuninitialized -Winit-self -Wno-narrowing -Wno-comment -Wimplicit-fallthrough=3 -Wno-strict-overflow -fdiagnostics-show-option -pthread -fomit-frame-pointer -ffunction-sections -fdata-sections  -msse -msse2 -mfpmath=sse -fvisibility=hidden -O3 -DNDEBUG  -DNDEBUG
--     C flags (Debug):             -fsigned-char -W -Wall -Werror=return-type -Werror=non-virtual-dtor -Werror=address -Werror=sequence-point -Wformat -Werror=format-security -Wmissing-declarations -Wmissing-prototypes -Wstrict-prototypes -Wundef -Winit-self -Wpointer-arith -Wshadow -Wuninitialized -Winit-self -Wno-narrowing -Wno-comment -Wimplicit-fallthrough=3 -Wno-strict-overflow -fdiagnostics-show-option -pthread -fomit-frame-pointer -ffunction-sections -fdata-sections  -msse -msse2 -mfpmath=sse -fvisibility=hidden -g  -O0 -DDEBUG -D_DEBUG
--     Linker flags (Release):     
--     Linker flags (Debug):       
--     ccache:                      YES
--     Precompiled headers:         NO
--     Extra dependencies:          dl m pthread rt
--     3rdparty dependencies:
--
--   OpenCV modules:
--     To be built:                 calib3d core dnn features2d flann gapi highgui imgcodecs imgproc java_bindings_generator ml objdetect photo python_bindings_generator stitching ts video videoio
--     Disabled:                    world
--     Disabled by dependency:      -
--     Unavailable:                 java js python2 python3
--     Applications:                tests perf_tests apps
--     Documentation:               NO
--     Non-free algorithms:         NO
--
--   GUI:
--     GTK+:                        YES (ver 2.24.32)
--       GThread :                  YES (ver 2.56.1)
--       GtkGlExt:                  NO
--     VTK support:                 NO
--
--   Media I/O:
--     ZLib:                        /usr/lib/libz.so (ver 1.2.11)
--     JPEG:                        /usr/lib/libjpeg.so (ver 80)
--     PNG:                         /usr/lib/libpng.so (ver 1.6.34)
--     TIFF:                        /usr/lib/libtiff.so (ver 42 / 4.0.9)
--     JPEG 2000:                   build (ver 1.900.1)
--     HDR:                         YES
--     SUNRASTER:                   YES
--     PXM:                         YES
--     PFM:                         YES
--
--   Video I/O:
--     DC1394:                      YES (ver 2.2.5)
--     FFMPEG:                      YES
--       avcodec:                   YES (ver 57.107.100)
--       avformat:                  YES (ver 57.83.100)
--       avutil:                    YES (ver 55.78.100)
--       swscale:                   YES (ver 4.8.100)
--       avresample:                NO
--     GStreamer:                   NO
--     v4l/v4l2:                    linux/videodev2.h
--
--   Parallel framework:            pthreads
--
--   Trace:                         YES (with Intel ITT)
--
--   Other third-party libraries:
--     Lapack:                      NO
--     Eigen:                       NO
--     Custom HAL:                  NO
--     Protobuf:                    build (3.5.1)
--
--   OpenCL:                        YES (no extra features)
--     Include path:                /root/opencv_build/opencv/3rdparty/include/opencl/1.2
--     Link libraries:              Dynamic load
--
--   Python (for build):            /usr/bin/python2.7
--
--   Java:                         
--     ant:                         NO
--     JNI:                         NO
--     Java wrappers:               NO
--     Java tests:                  NO
--
--   Install to:                    /usr/local
-- -----------------------------------------------------------------
--
-- Configuring done
-- Generating done
-- Build files have been written to: /root/opencv_build/opencv/build




Code:
 39%] Building CXX object modules/dnn/CMakeFiles/opencv_dnn.dir/src/layers/proposal_layer.cpp.o
[ 39%] Building CXX object modules/dnn/CMakeFiles/opencv_dnn.dir/src/layers/recurrent_layers.cpp.o
[ 39%] Building CXX object modules/dnn/CMakeFiles/opencv_dnn.dir/src/layers/region_layer.cpp.o
[ 39%] Building CXX object modules/dnn/CMakeFiles/opencv_dnn.dir/src/layers/reorg_layer.cpp.o
[ 40%] Building CXX object modules/dnn/CMakeFiles/opencv_dnn.dir/src/layers/reshape_layer.cpp.o
[ 40%] Building CXX object modules/dnn/CMakeFiles/opencv_dnn.dir/src/layers/resize_layer.cpp.o
[ 40%] Building CXX object modules/dnn/CMakeFiles/opencv_dnn.dir/src/layers/scale_layer.cpp.o
[ 40%] Building CXX object modules/dnn/CMakeFiles/opencv_dnn.dir/src/layers/shuffle_channel_layer.cpp.o
[ 40%] Building CXX object modules/dnn/CMakeFiles/opencv_dnn.dir/src/layers/slice_layer.cpp.o
[ 40%] Building CXX object modules/dnn/CMakeFiles/opencv_dnn.dir/src/layers/softmax_layer.cpp.o
[ 40%] Building CXX object modules/dnn/CMakeFiles/opencv_dnn.dir/src/layers/split_layer.cpp.o
[ 40%] Building CXX object modules/dnn/CMakeFiles/opencv_dnn.dir/src/nms.cpp.o
[ 40%] Building CXX object modules/dnn/CMakeFiles/opencv_dnn.dir/src/ocl4dnn/src/common.cpp.o
[ 40%] Building CXX object modules/dnn/CMakeFiles/opencv_dnn.dir/src/ocl4dnn/src/math_functions.cpp.o
[ 40%] Building CXX object modules/dnn/CMakeFiles/opencv_dnn.dir/src/ocl4dnn/src/ocl4dnn_conv_spatial.cpp.o
[ 41%] Building CXX object modules/dnn/CMakeFiles/opencv_dnn.dir/src/ocl4dnn/src/ocl4dnn_inner_product.cpp.o
[ 41%] Building CXX object modules/dnn/CMakeFiles/opencv_dnn.dir/src/ocl4dnn/src/ocl4dnn_lrn.cpp.o
[ 41%] Building CXX object modules/dnn/CMakeFiles/opencv_dnn.dir/src/ocl4dnn/src/ocl4dnn_pool.cpp.o
[ 41%] Building CXX object modules/dnn/CMakeFiles/opencv_dnn.dir/src/ocl4dnn/src/ocl4dnn_softmax.cpp.o
[ 41%] Building CXX object modules/dnn/CMakeFiles/opencv_dnn.dir/src/onnx/onnx_importer.cpp.o
[ 41%] Building CXX object modules/dnn/CMakeFiles/opencv_dnn.dir/src/op_halide.cpp.o
[ 41%] Building CXX object modules/dnn/CMakeFiles/opencv_dnn.dir/src/op_inf_engine.cpp.o
[ 41%] Building CXX object modules/dnn/CMakeFiles/opencv_dnn.dir/src/op_vkcom.cpp.o
[ 41%] Building CXX object modules/dnn/CMakeFiles/opencv_dnn.dir/src/tensorflow/tf_graph_simplifier.cpp.o
[ 41%] Building CXX object modules/dnn/CMakeFiles/opencv_dnn.dir/src/tensorflow/tf_importer.cpp.o
[ 42%] Building CXX object modules/dnn/CMakeFiles/opencv_dnn.dir/src/tensorflow/tf_io.cpp.o
[ 42%] Building CXX object modules/dnn/CMakeFiles/opencv_dnn.dir/src/torch/THDiskFile.cpp.o
[ 42%] Building CXX object modules/dnn/CMakeFiles/opencv_dnn.dir/src/torch/THFile.cpp.o
[ 42%] Building CXX object modules/dnn/CMakeFiles/opencv_dnn.dir/src/torch/THGeneral.cpp.o
[ 42%] Building CXX object modules/dnn/CMakeFiles/opencv_dnn.dir/src/torch/torch_importer.cpp.o
[ 42%] Building CXX object modules/dnn/CMakeFiles/opencv_dnn.dir/src/vkcom/shader/avg_pool_spv.cpp.o
[ 42%] Building CXX object modules/dnn/CMakeFiles/opencv_dnn.dir/src/vkcom/shader/concat_spv.cpp.o
[ 42%] Building CXX object modules/dnn/CMakeFiles/opencv_dnn.dir/src/vkcom/shader/conv_spv.cpp.o
[ 42%] Building CXX object modules/dnn/CMakeFiles/opencv_dnn.dir/src/vkcom/shader/dw_conv_spv.cpp.o
[ 42%] Building CXX object modules/dnn/CMakeFiles/opencv_dnn.dir/src/vkcom/shader/lrn_spv.cpp.o
[ 43%] Building CXX object modules/dnn/CMakeFiles/opencv_dnn.dir/src/vkcom/shader/max_pool_spv.cpp.o
[ 43%] Building CXX object modules/dnn/CMakeFiles/opencv_dnn.dir/src/vkcom/shader/permute_spv.cpp.o
[ 43%] Building CXX object modules/dnn/CMakeFiles/opencv_dnn.dir/src/vkcom/shader/prior_box_spv.cpp.o
[ 43%] Building CXX object modules/dnn/CMakeFiles/opencv_dnn.dir/src/vkcom/shader/relu_spv.cpp.o
[ 43%] Building CXX object modules/dnn/CMakeFiles/opencv_dnn.dir/src/vkcom/shader/softmax_spv.cpp.o
[ 43%] Building CXX object modules/dnn/CMakeFiles/opencv_dnn.dir/src/vkcom/src/buffer.cpp.o
[ 43%] Building CXX object modules/dnn/CMakeFiles/opencv_dnn.dir/src/vkcom/src/internal.cpp.o
[ 43%] Building CXX object modules/dnn/CMakeFiles/opencv_dnn.dir/src/vkcom/src/op_base.cpp.o
[ 43%] Building CXX object modules/dnn/CMakeFiles/opencv_dnn.dir/src/vkcom/src/op_concat.cpp.o
[ 43%] Building CXX object modules/dnn/CMakeFiles/opencv_dnn.dir/src/vkcom/src/op_conv.cpp.o
[ 44%] Building CXX object modules/dnn/CMakeFiles/opencv_dnn.dir/src/vkcom/src/op_lrn.cpp.o
[ 44%] Building CXX object modules/dnn/CMakeFiles/opencv_dnn.dir/src/vkcom/src/op_permute.cpp.o
[ 44%] Building CXX object modules/dnn/CMakeFiles/opencv_dnn.dir/src/vkcom/src/op_pool.cpp.o
[ 44%] Building CXX object modules/dnn/CMakeFiles/opencv_dnn.dir/src/vkcom/src/op_prior_box.cpp.o
[ 44%] Building CXX object modules/dnn/CMakeFiles/opencv_dnn.dir/src/vkcom/src/op_relu.cpp.o
[ 44%] Building CXX object modules/dnn/CMakeFiles/opencv_dnn.dir/src/vkcom/src/op_softmax.cpp.o
[ 44%] Building CXX object modules/dnn/CMakeFiles/opencv_dnn.dir/src/vkcom/src/tensor.cpp.o
[ 44%] Building CXX object modules/dnn/CMakeFiles/opencv_dnn.dir/src/vkcom/src/vkcom.cpp.o
[ 44%] Building CXX object modules/dnn/CMakeFiles/opencv_dnn.dir/src/vkcom/vulkan/vk_functions.cpp.o
[ 44%] Building CXX object modules/dnn/CMakeFiles/opencv_dnn.dir/src/vkcom/vulkan/vk_loader.cpp.o
[ 44%] Building CXX object modules/dnn/CMakeFiles/opencv_dnn.dir/opencl_kernels_dnn.cpp.o
[ 45%] Building CXX object modules/dnn/CMakeFiles/opencv_dnn.dir/layers/layers_common.avx.cpp.o
[ 45%] Linking CXX shared library ../../lib/libopencv_dnn.so
[ 45%] Built target opencv_dnn
Makefile:162: recipe for target 'all' failed
make: *** [all] Error 2


any ideas or insight or a recipe will be highly appreciated......

Last edited by rockedge on Tue 20 Nov 2018, 16:42; edited 2 times in total
Back to top
View user's profile Send private message Visit poster's website 
rockedge


Joined: 11 Apr 2012
Posts: 1005
Location: Connecticut, United States

PostPosted: Tue 20 Nov 2018, 12:53    Post subject:  

the end of the output during compile using:

Quote:
cmake -D INSTALL_C_EXAMPLES=OFF -D WITH_WEBP=OFF -D WITH_OPENEXR=OFF -D WITH_IPP=OFF -D WITH_V4L=ON -D WITH_QT=OFF ..

Code:
make


Code:
[ 29%] Building CXX object modules/imgproc/CMakeFiles/opencv_imgproc.dir/accum.avx.cpp.o
[ 29%] Linking CXX shared library ../../lib/libopencv_imgproc.so
[ 29%] Built target opencv_imgproc
Scanning dependencies of target opencv_imgcodecs
[ 29%] Building CXX object modules/imgcodecs/CMakeFiles/opencv_imgcodecs.dir/src/loadsave.cpp.o
In file included from /usr/include/c++/7/ext/string_conversions.h:41:0,
                 from /usr/include/c++/7/bits/basic_string.h:6349,
                 from /usr/include/c++/7/string:52,
                 from /usr/include/c++/7/stdexcept:39,
                 from /usr/include/c++/7/array:39,
                 from /root/opencv_build/opencv/modules/core/include/opencv2/core/cvdef.h:659,
                 from /root/opencv_build/opencv/modules/core/include/opencv2/core.hpp:52,
                 from /root/opencv_build/opencv/modules/imgcodecs/include/opencv2/imgcodecs.hpp:46,
                 from /root/opencv_build/opencv/modules/imgcodecs/src/precomp.hpp:45,
                 from /root/opencv_build/opencv/modules/imgcodecs/src/loadsave.cpp:46:
/usr/include/c++/7/cstdlib:75:15: fatal error: stdlib.h: No such file or directory
 #include_next <stdlib.h>
               ^~~~~~~~~~
compilation terminated.
modules/imgcodecs/CMakeFiles/opencv_imgcodecs.dir/build.make:62: recipe for target 'modules/imgcodecs/CMakeFiles/opencv_imgcodecs.dir/src/loadsave.cpp.o' failed
make[2]: *** [modules/imgcodecs/CMakeFiles/opencv_imgcodecs.dir/src/loadsave.cpp.o] Error 1
CMakeFiles/Makefile2:2122: recipe for target 'modules/imgcodecs/CMakeFiles/opencv_imgcodecs.dir/all' failed
make[1]: *** [modules/imgcodecs/CMakeFiles/opencv_imgcodecs.dir/all] Error 2
Makefile:162: recipe for target 'all' failed
make: *** [all] Error 2
build #
Back to top
View user's profile Send private message Visit poster's website 
rockedge


Joined: 11 Apr 2012
Posts: 1005
Location: Connecticut, United States

PostPosted: Tue 20 Nov 2018, 16:31    Post subject:  

I solved the problem by using
Code:
cmake ..
cmake -LA | awk '{if(f)print} /-- Cache values/{f=1}'


which gave me the list of cmake options for Opencv

Code:
ANT_EXECUTABLE:FILEPATH=ANT_EXECUTABLE-NOTFOUND
Atlas_BLAS_LIBRARY:FILEPATH=Atlas_BLAS_LIBRARY-NOTFOUND
Atlas_CBLAS_INCLUDE_DIR:PATH=Atlas_CBLAS_INCLUDE_DIR-NOTFOUND
Atlas_CBLAS_LIBRARY:FILEPATH=Atlas_CBLAS_LIBRARY-NOTFOUND
Atlas_CLAPACK_INCLUDE_DIR:PATH=Atlas_CLAPACK_INCLUDE_DIR-NOTFOUND
Atlas_LAPACK_LIBRARY:FILEPATH=Atlas_LAPACK_LIBRARY-NOTFOUND
BLAS_Accelerate_LIBRARY:FILEPATH=BLAS_Accelerate_LIBRARY-NOTFOUND
BLAS_acml_LIBRARY:FILEPATH=BLAS_acml_LIBRARY-NOTFOUND
BLAS_acml_mp_LIBRARY:FILEPATH=BLAS_acml_mp_LIBRARY-NOTFOUND
BLAS_blas_LIBRARY:FILEPATH=BLAS_blas_LIBRARY-NOTFOUND
BLAS_complib.sgimath_LIBRARY:FILEPATH=BLAS_complib.sgimath_LIBRARY-NOTFOUND
BLAS_cxml_LIBRARY:FILEPATH=BLAS_cxml_LIBRARY-NOTFOUND
BLAS_dxml_LIBRARY:FILEPATH=BLAS_dxml_LIBRARY-NOTFOUND
BLAS_essl_LIBRARY:FILEPATH=BLAS_essl_LIBRARY-NOTFOUND
BLAS_f77blas_LIBRARY:FILEPATH=BLAS_f77blas_LIBRARY-NOTFOUND
BLAS_goto2_LIBRARY:FILEPATH=BLAS_goto2_LIBRARY-NOTFOUND
BLAS_mkl_LIBRARY:FILEPATH=BLAS_mkl_LIBRARY-NOTFOUND
BLAS_mkl_em64t_LIBRARY:FILEPATH=BLAS_mkl_em64t_LIBRARY-NOTFOUND
BLAS_mkl_ia32_LIBRARY:FILEPATH=BLAS_mkl_ia32_LIBRARY-NOTFOUND
BLAS_mkl_intel_LIBRARY:FILEPATH=BLAS_mkl_intel_LIBRARY-NOTFOUND
BLAS_mkl_intel_lp64_LIBRARY:FILEPATH=BLAS_mkl_intel_lp64_LIBRARY-NOTFOUND
BLAS_openblas_LIBRARY:FILEPATH=BLAS_openblas_LIBRARY-NOTFOUND
BLAS_scsl_LIBRARY:FILEPATH=BLAS_scsl_LIBRARY-NOTFOUND
BLAS_sgemm_LIBRARY:FILEPATH=BLAS_sgemm_LIBRARY-NOTFOUND
BLAS_sunperf_LIBRARY:FILEPATH=BLAS_sunperf_LIBRARY-NOTFOUND
BLAS_vecLib_LIBRARY:FILEPATH=BLAS_vecLib_LIBRARY-NOTFOUND
BUILD_CUDA_STUBS:BOOL=OFF
BUILD_DOCS:BOOL=OFF
BUILD_EXAMPLES:BOOL=OFF
BUILD_IPP_IW:BOOL=ON
BUILD_ITT:BOOL=ON
BUILD_JASPER:BOOL=OFF
BUILD_JAVA:BOOL=ON
BUILD_JPEG:BOOL=OFF
BUILD_LIST:STRING=
BUILD_OPENEXR:BOOL=OFF
BUILD_PACKAGE:BOOL=ON
BUILD_PERF_TESTS:BOOL=OFF
BUILD_PNG:BOOL=OFF
BUILD_PROTOBUF:BOOL=ON
BUILD_SHARED_LIBS:BOOL=ON
BUILD_TBB:BOOL=OFF
BUILD_TESTS:BOOL=OFF
BUILD_TIFF:BOOL=OFF
BUILD_USE_SYMLINKS:BOOL=OFF
BUILD_WEBP:BOOL=OFF
BUILD_WITH_DEBUG_INFO:BOOL=OFF
BUILD_WITH_DYNAMIC_IPP:BOOL=OFF
BUILD_ZLIB:BOOL=OFF
BUILD_opencv_apps:BOOL=ON
BUILD_opencv_calib3d:BOOL=ON
BUILD_opencv_core:BOOL=ON
BUILD_opencv_dnn:BOOL=ON
BUILD_opencv_features2d:BOOL=ON
BUILD_opencv_flann:BOOL=ON
BUILD_opencv_gapi:BOOL=ON
BUILD_opencv_highgui:BOOL=ON
BUILD_opencv_imgcodecs:BOOL=ON
BUILD_opencv_imgproc:BOOL=ON
BUILD_opencv_java_bindings_generator:BOOL=ON
BUILD_opencv_js:BOOL=OFF
BUILD_opencv_ml:BOOL=ON
BUILD_opencv_objdetect:BOOL=ON
BUILD_opencv_photo:BOOL=ON
BUILD_opencv_python_bindings_generator:BOOL=ON
BUILD_opencv_stitching:BOOL=ON
BUILD_opencv_video:BOOL=ON
BUILD_opencv_videoio:BOOL=ON
BUILD_opencv_world:BOOL=OFF
CCACHE_PROGRAM:FILEPATH=/usr/bin/ccache
CLAMDBLAS_INCLUDE_DIR:PATH=CLAMDBLAS_INCLUDE_DIR-NOTFOUND
CLAMDBLAS_ROOT_DIR:PATH=CLAMDBLAS_ROOT_DIR-NOTFOUND
CLAMDFFT_INCLUDE_DIR:PATH=CLAMDFFT_INCLUDE_DIR-NOTFOUND
CLAMDFFT_ROOT_DIR:PATH=CLAMDFFT_ROOT_DIR-NOTFOUND
CMAKE_AR:FILEPATH=/usr/bin/ar
CMAKE_BUILD_TYPE:STRING=RELEASE
CMAKE_COLOR_MAKEFILE:BOOL=ON
CMAKE_CONFIGURATION_TYPES:STRING=Debug;Release
CMAKE_CXX_COMPILER:FILEPATH=/usr/bin/c++
CMAKE_CXX_COMPILER_AR:FILEPATH=/usr/bin/gcc-ar-7
CMAKE_CXX_COMPILER_RANLIB:FILEPATH=/usr/bin/gcc-ranlib-7
CMAKE_CXX_FLAGS:STRING=
CMAKE_CXX_FLAGS_DEBUG:STRING=-g
CMAKE_CXX_FLAGS_MINSIZEREL:STRING=-Os -DNDEBUG
CMAKE_CXX_FLAGS_RELEASE:STRING=-O3 -DNDEBUG
CMAKE_CXX_FLAGS_RELWITHDEBINFO:STRING=-O2 -g -DNDEBUG
CMAKE_C_COMPILER:FILEPATH=/usr/bin/cc
CMAKE_C_COMPILER_AR:FILEPATH=/usr/bin/gcc-ar-7
CMAKE_C_COMPILER_RANLIB:FILEPATH=/usr/bin/gcc-ranlib-7
CMAKE_C_FLAGS:STRING=
CMAKE_C_FLAGS_DEBUG:STRING=-g
CMAKE_C_FLAGS_MINSIZEREL:STRING=-Os -DNDEBUG
CMAKE_C_FLAGS_RELEASE:STRING=-O3 -DNDEBUG
CMAKE_C_FLAGS_RELWITHDEBINFO:STRING=-O2 -g -DNDEBUG
CMAKE_EXE_LINKER_FLAGS:STRING=
CMAKE_EXE_LINKER_FLAGS_DEBUG:STRING=
CMAKE_EXE_LINKER_FLAGS_MINSIZEREL:STRING=
CMAKE_EXE_LINKER_FLAGS_RELEASE:STRING=
CMAKE_EXE_LINKER_FLAGS_RELWITHDEBINFO:STRING=
CMAKE_EXPORT_COMPILE_COMMANDS:BOOL=OFF
CMAKE_INSTALL_BINDIR:PATH=bin
CMAKE_INSTALL_DATADIR:PATH=
CMAKE_INSTALL_DATAROOTDIR:PATH=share
CMAKE_INSTALL_DOCDIR:PATH=
CMAKE_INSTALL_INCLUDEDIR:PATH=include
CMAKE_INSTALL_INFODIR:PATH=
CMAKE_INSTALL_LIBDIR:PATH=lib
CMAKE_INSTALL_LIBEXECDIR:PATH=libexec
CMAKE_INSTALL_LOCALEDIR:PATH=
CMAKE_INSTALL_LOCALSTATEDIR:PATH=var
CMAKE_INSTALL_MANDIR:PATH=
CMAKE_INSTALL_OLDINCLUDEDIR:PATH=/usr/include
CMAKE_INSTALL_PREFIX:PATH=/usr/local
CMAKE_INSTALL_RUNSTATEDIR:PATH=
CMAKE_INSTALL_SBINDIR:PATH=sbin
CMAKE_INSTALL_SHAREDSTATEDIR:PATH=com
CMAKE_INSTALL_SYSCONFDIR:PATH=etc
CMAKE_LINKER:FILEPATH=/usr/bin/ld
CMAKE_MAKE_PROGRAM:FILEPATH=/usr/bin/make
CMAKE_MODULE_LINKER_FLAGS:STRING=
CMAKE_MODULE_LINKER_FLAGS_DEBUG:STRING=
CMAKE_MODULE_LINKER_FLAGS_MINSIZEREL:STRING=
CMAKE_MODULE_LINKER_FLAGS_RELEASE:STRING=
CMAKE_MODULE_LINKER_FLAGS_RELWITHDEBINFO:STRING=
CMAKE_NM:FILEPATH=/usr/bin/nm
CMAKE_OBJCOPY:FILEPATH=/usr/bin/objcopy
CMAKE_OBJDUMP:FILEPATH=/usr/bin/objdump
CMAKE_RANLIB:FILEPATH=/usr/bin/ranlib
CMAKE_SHARED_LINKER_FLAGS:STRING=
CMAKE_SHARED_LINKER_FLAGS_DEBUG:STRING=
CMAKE_SHARED_LINKER_FLAGS_MINSIZEREL:STRING=
CMAKE_SHARED_LINKER_FLAGS_RELEASE:STRING=
CMAKE_SHARED_LINKER_FLAGS_RELWITHDEBINFO:STRING=
CMAKE_SKIP_INSTALL_RPATH:BOOL=NO
CMAKE_SKIP_RPATH:BOOL=NO
CMAKE_STATIC_LINKER_FLAGS:STRING=
CMAKE_STATIC_LINKER_FLAGS_DEBUG:STRING=
CMAKE_STATIC_LINKER_FLAGS_MINSIZEREL:STRING=
CMAKE_STATIC_LINKER_FLAGS_RELEASE:STRING=
CMAKE_STATIC_LINKER_FLAGS_RELWITHDEBINFO:STRING=
CMAKE_STRIP:FILEPATH=/usr/bin/strip
CMAKE_VERBOSE_MAKEFILE:BOOL=FALSE
CPACK_BINARY_DEB:BOOL=OFF
CPACK_BINARY_FREEBSD:BOOL=OFF
CPACK_BINARY_IFW:BOOL=OFF
CPACK_BINARY_NSIS:BOOL=OFF
CPACK_BINARY_RPM:BOOL=OFF
CPACK_BINARY_STGZ:BOOL=ON
CPACK_BINARY_TBZ2:BOOL=OFF
CPACK_BINARY_TGZ:BOOL=ON
CPACK_BINARY_TXZ:BOOL=OFF
CPACK_BINARY_TZ:BOOL=ON
CPACK_SOURCE_RPM:BOOL=OFF
CPACK_SOURCE_TBZ2:BOOL=ON
CPACK_SOURCE_TGZ:BOOL=ON
CPACK_SOURCE_TXZ:BOOL=ON
CPACK_SOURCE_TZ:BOOL=ON
CPACK_SOURCE_ZIP:BOOL=OFF
CPU_BASELINE:STRING=SSE2
CPU_DISPATCH:STRING=SSE4_1;SSE4_2;AVX;FP16
CV_DISABLE_OPTIMIZATION:BOOL=OFF
CV_ENABLE_INTRINSICS:BOOL=ON
CV_TRACE:BOOL=ON
EIGEN_INCLUDE_PATH:PATH=EIGEN_INCLUDE_PATH-NOTFOUND
ENABLE_BUILD_HARDENING:BOOL=OFF
ENABLE_CCACHE:BOOL=ON
ENABLE_COVERAGE:BOOL=OFF
ENABLE_FAST_MATH:BOOL=OFF
ENABLE_FLAKE8:BOOL=OFF
ENABLE_GNU_STL_DEBUG:BOOL=OFF
ENABLE_IMPL_COLLECTION:BOOL=OFF
ENABLE_INSTRUMENTATION:BOOL=OFF
ENABLE_LTO:BOOL=OFF
ENABLE_NOISY_WARNINGS:BOOL=OFF
ENABLE_OMIT_FRAME_POINTER:BOOL=ON
ENABLE_PIC:BOOL=ON
ENABLE_PRECOMPILED_HEADERS:BOOL=OFF
ENABLE_PROFILING:BOOL=OFF
ENABLE_PYLINT:BOOL=OFF
ENABLE_SOLUTION_FOLDERS:BOOL=OFF
EXECUTABLE_OUTPUT_PATH:PATH=/root/ftpd/opencv/build/bin
GENERATE_ABI_DESCRIPTOR:BOOL=OFF
GIT_EXECUTABLE:FILEPATH=/usr/bin/git
INSTALL_CREATE_DISTRIB:BOOL=OFF
INSTALL_C_EXAMPLES:BOOL=OFF
INSTALL_PYTHON_EXAMPLES:BOOL=OFF
INSTALL_TESTS:BOOL=OFF
INSTALL_TO_MANGLED_PATHS:BOOL=OFF
JASPER_LIBRARY_DEBUG:FILEPATH=JASPER_LIBRARY_DEBUG-NOTFOUND
JASPER_LIBRARY_RELEASE:FILEPATH=JASPER_LIBRARY_RELEASE-NOTFOUND
JAVA_AWT_INCLUDE_PATH:PATH=JAVA_AWT_INCLUDE_PATH-NOTFOUND
JAVA_AWT_LIBRARY:FILEPATH=JAVA_AWT_LIBRARY-NOTFOUND
JAVA_INCLUDE_PATH:PATH=JAVA_INCLUDE_PATH-NOTFOUND
JAVA_INCLUDE_PATH2:PATH=JAVA_INCLUDE_PATH2-NOTFOUND
JAVA_JVM_LIBRARY:FILEPATH=JAVA_JVM_LIBRARY-NOTFOUND
JPEG_INCLUDE_DIR:PATH=/usr/include/i386-linux-gnu
JPEG_LIBRARY:FILEPATH=/usr/lib/libjpeg.so
LAPACK_CBLAS_H:STRING=
LAPACK_IMPL:STRING=Unknown
LAPACK_INCLUDE_DIR:PATH=
LAPACK_LAPACKE_H:STRING=
LAPACK_LIBRARIES:STRING=
MKL_INCLUDE_DIRS:PATH=MKL_ROOT_DIR-NOTFOUND/include
MKL_ROOT_DIR:PATH=MKL_ROOT_DIR-NOTFOUND
MKL_WITH_OPENMP:BOOL=OFF
MKL_WITH_TBB:BOOL=OFF
OPENCL_FOUND:BOOL=ON
OPENCL_INCLUDE_DIR:PATH=/root/ftpd/opencv/3rdparty/include/opencl/1.2
OPENCL_LIBRARY:STRING=
OPENCV_CONFIG_FILE_INCLUDE_DIR:PATH=/root/ftpd/opencv/build
OPENCV_DNN_OPENCL:BOOL=ON
OPENCV_DOWNLOAD_PATH:PATH=/root/ftpd/opencv/.cache
OPENCV_DUMP_HOOKS_FLOW:BOOL=OFF
OPENCV_ENABLE_NONFREE:BOOL=OFF
OPENCV_EXTRA_MODULES_PATH:PATH=
OPENCV_FORCE_3RDPARTY_BUILD:BOOL=OFF
OPENCV_GENERATE_PKGCONFIG:BOOL=OFF
OPENCV_GENERATE_SETUPVARS:BOOL=ON
OPENCV_PYTHON3_VERSION:BOOL=OFF
OPENCV_TIMESTAMP:STRING=2018-11-20T19:21:51Z
OPENCV_WARNINGS_ARE_ERRORS:BOOL=OFF
OpenBLAS_INCLUDE_DIR:PATH=OpenBLAS_INCLUDE_DIR-NOTFOUND
OpenBLAS_LIB:FILEPATH=OpenBLAS_LIB-NOTFOUND
OpenCV_HAL_DIR:PATH=OpenCV_HAL_DIR-NOTFOUND
PKG_CONFIG_EXECUTABLE:FILEPATH=/usr/bin/pkg-config
PNG_LIBRARY_DEBUG:FILEPATH=PNG_LIBRARY_DEBUG-NOTFOUND
PNG_LIBRARY_RELEASE:FILEPATH=/usr/lib/libpng.so
PNG_PNG_INCLUDE_DIR:PATH=/usr/include/i386-linux-gnu
PROTOBUF_UPDATE_FILES:BOOL=OFF
PYTHON2_EXECUTABLE:FILEPATH=/usr/bin/python2.7
PYTHON2_INCLUDE_DIR:PATH=/usr/include/python2.7
PYTHON2_INCLUDE_DIR2:PATH=
PYTHON2_LIBRARY:FILEPATH=/usr/lib/libpython2.7.so
PYTHON2_LIBRARY_DEBUG:FILEPATH=
PYTHON2_NUMPY_INCLUDE_DIRS:PATH=
PYTHON2_PACKAGES_PATH:PATH=lib/python2.7/dist-packages
PYTHON3_EXECUTABLE:FILEPATH=/usr/bin/python3
PYTHON3_INCLUDE_DIR:PATH=
PYTHON3_INCLUDE_DIR2:PATH=
PYTHON3_LIBRARY:FILEPATH=
PYTHON3_LIBRARY_DEBUG:FILEPATH=
PYTHON3_NUMPY_INCLUDE_DIRS:PATH=/usr/lib/python3/dist-packages/numpy/core/include
PYTHON3_PACKAGES_PATH:PATH=lib/python3.6/dist-packages
TIFF_INCLUDE_DIR:PATH=/usr/include/i386-linux-gnu
TIFF_LIBRARY_DEBUG:FILEPATH=TIFF_LIBRARY_DEBUG-NOTFOUND
TIFF_LIBRARY_RELEASE:FILEPATH=/usr/lib/libtiff.so
VTK_DIR:PATH=VTK_DIR-NOTFOUND
WITH_1394:BOOL=ON
WITH_ARAVIS:BOOL=OFF
WITH_CLP:BOOL=OFF
WITH_CUBLAS:BOOL=ON
WITH_CUDA:BOOL=OFF
WITH_CUFFT:BOOL=ON
WITH_EIGEN:BOOL=ON
WITH_FFMPEG:BOOL=ON
WITH_GDAL:BOOL=OFF
WITH_GDCM:BOOL=OFF
WITH_GIGEAPI:BOOL=OFF
WITH_GPHOTO2:BOOL=OFF
WITH_GSTREAMER:BOOL=ON
WITH_GSTREAMER_0_10:BOOL=OFF
WITH_GTK:BOOL=ON
WITH_GTK_2_X:BOOL=OFF
WITH_HALIDE:BOOL=OFF
WITH_HPX:BOOL=OFF
WITH_IMGCODEC_HDR:BOOL=OFF
WITH_IMGCODEC_PFM:BOOL=ON
WITH_IMGCODEC_PXM:BOOL=ON
WITH_IMGCODEC_SUNRASTER:BOOL=ON
WITH_INF_ENGINE:BOOL=OFF
WITH_IPP:BOOL=ON
WITH_ITT:BOOL=ON
WITH_JASPER:BOOL=ON
WITH_JPEG:BOOL=ON
WITH_LAPACK:BOOL=ON
WITH_LIBREALSENSE:BOOL=OFF
WITH_MFX:BOOL=OFF
WITH_NVCUVID:BOOL=ON
WITH_OPENCL:BOOL=ON
WITH_OPENCLAMDBLAS:BOOL=ON
WITH_OPENCLAMDFFT:BOOL=ON
WITH_OPENCL_SVM:BOOL=OFF
WITH_OPENEXR:BOOL=OFF
WITH_OPENGL:BOOL=OFF
WITH_OPENMP:BOOL=OFF
WITH_OPENNI:BOOL=OFF
WITH_OPENNI2:BOOL=OFF
WITH_OPENVX:BOOL=OFF
WITH_PNG:BOOL=ON
WITH_PROTOBUF:BOOL=ON
WITH_PTHREADS_PF:BOOL=ON
WITH_PVAPI:BOOL=OFF
WITH_QT:BOOL=OFF
WITH_QUIRC:BOOL=ON
WITH_TBB:BOOL=OFF
WITH_TIFF:BOOL=ON
WITH_V4L:BOOL=ON
WITH_VA:BOOL=OFF
WITH_VA_INTEL:BOOL=OFF
WITH_VTK:BOOL=ON
WITH_VULKAN:BOOL=OFF
WITH_WEBP:BOOL=OFF
WITH_XIMEA:BOOL=OFF
WITH_XINE:BOOL=OFF
ZLIB_INCLUDE_DIR:PATH=/usr/include/i386-linux-gnu
ZLIB_LIBRARY_DEBUG:FILEPATH=ZLIB_LIBRARY_DEBUG-NOTFOUND
ZLIB_LIBRARY_RELEASE:FILEPATH=/usr/lib/libz.so
opencv_dnn_PERF_CAFFE:BOOL=OFF
opencv_dnn_PERF_CLCAFFE:BOOL=OFF


I adjusted the cmake to :
Code:
cmake -D CMAKE_BUILD_TYPE=RELEASE -D BUILD_EXAMPLES=OFF -D BUILD_OPENCV_APPS=OFF -D BUILD_DOCS=OFF -D BUILD_PERF_TESTS=OFF -D BUILD_TESTS=OFF -D CMAKE_INSTALL_PREFIX=/usr/local/ -D WITH_OPENEXR=OFF OPENCV_BUILD_3RDPARTY_LIBS=ON -D WITH_WEBP=OFF -D WITH_OPENGL=OFF -D WITH_V4L=ON -D WITH_LIBV4L=OFF -D INSTALL_C_EXAMPLES=OFF -D BUILD_opencv_imgcodecs=OFF ..


and I received this output after
Code:
make

[100%] Linking CXX executable ../../bin/opencv_version
[100%] Built target opencv_version
# make install
[  6%] Built target libjasper
[ 20%] Built target libprotobuf
[ 21%] Built target quirc
[ 22%] Built target ittnotify
[ 25%] Built target ade
[ 40%] Built target opencv_core
[ 41%] Built target opencv_flann
[ 53%] Built target opencv_imgproc
[ 56%] Built target opencv_ml
[ 58%] Built target opencv_photo
[ 76%] Built target opencv_dnn
[ 80%] Built target opencv_features2d
[ 87%] Built target opencv_gapi
[ 92%] Built target opencv_calib3d
[ 94%] Built target opencv_objdetect
[ 97%] Built target opencv_stitching
[100%] Built target opencv_video
[100%] Built target opencv_version
Install the project...
-- Install configuration: "RELEASE"
-- Installing: /usr/local/share/licenses/opencv4/opencl-headers-LICENSE.txt
-- Installing: /usr/local/include/opencv4/opencv2/cvconfig.h
-- Installing: /usr/local/include/opencv4/opencv2/opencv_modules.hpp
-- Installing: /usr/local/lib/cmake/opencv4/OpenCVModules.cmake
-- Installing: /usr/local/lib/cmake/opencv4/OpenCVModules-release.cmake
-- Installing: /usr/local/lib/cmake/opencv4/OpenCVConfig-version.cmake
-- Installing: /usr/local/lib/cmake/opencv4/OpenCVConfig.cmake
-- Installing: /usr/local/bin/setup_vars_opencv4.sh
-- Installing: /usr/local/share/opencv4/valgrind.supp
-- Installing: /usr/local/share/opencv4/valgrind_3rdparty.supp
-- Installing: /usr/local/share/licenses/opencv4/jasper-LICENSE
-- Installing: /usr/local/share/licenses/opencv4/jasper-README
-- Installing: /usr/local/share/licenses/opencv4/jasper-copyright
-- Installing: /usr/local/share/licenses/opencv4/protobuf-LICENSE
-- Installing: /usr/local/share/licenses/opencv4/protobuf-README.md
-- Installing: /usr/local/share/licenses/opencv4/quirc-LICENSE
-- Installing: /usr/local/share/licenses/opencv4/ittnotify-LICENSE.BSD
-- Installing: /usr/local/share/licenses/opencv4/ittnotify-LICENSE.GPL
-- Installing: /usr/local/include/opencv4/opencv2/opencv.hpp
-- Installing: /usr/local/share/licenses/opencv4/ade-LICENSE
-- Installing: /usr/local/python/setup.py
-- Installing: /usr/local/python/cv2/__init__.py
-- Installing: /usr/local/python/cv2/load_config_py2.py
-- Installing: /usr/local/python/cv2/load_config_py3.py
-- Installing: /usr/local/python/cv2/config.py
-- Installing: /usr/local/lib/libopencv_core.so.4.0.0
-- Installing: /usr/local/lib/libopencv_core.so.4.0
-- Set runtime path of "/usr/local/lib/libopencv_core.so.4.0.0" to "/usr/local/lib"
-- Installing: /usr/local/lib/libopencv_core.so
-- Installing: /usr/local/include/opencv4/opencv2/core/opencl/ocl_defs.hpp
-- Installing: /usr/local/include/opencv4/opencv2/core/opencl/opencl_info.hpp
-- Installing: /usr/local/include/opencv4/opencv2/core/opencl/opencl_svm.hpp
-- Installing: /usr/local/include/opencv4/opencv2/core/opencl/runtime/autogenerated/opencl_clamdblas.hpp
-- Installing: /usr/local/include/opencv4/opencv2/core/opencl/runtime/autogenerated/opencl_clamdfft.hpp
-- Installing: /usr/local/include/opencv4/opencv2/core/opencl/runtime/autogenerated/opencl_core.hpp
-- Installing: /usr/local/include/opencv4/opencv2/core/opencl/runtime/autogenerated/opencl_core_wrappers.hpp
-- Installing: /usr/local/include/opencv4/opencv2/core/opencl/runtime/autogenerated/opencl_gl.hpp
-- Installing: /usr/local/include/opencv4/opencv2/core/opencl/runtime/autogenerated/opencl_gl_wrappers.hpp
-- Installing: /usr/local/include/opencv4/opencv2/core/opencl/runtime/opencl_clamdblas.hpp
-- Installing: /usr/local/include/opencv4/opencv2/core/opencl/runtime/opencl_clamdfft.hpp
-- Installing: /usr/local/include/opencv4/opencv2/core/opencl/runtime/opencl_core.hpp
-- Installing: /usr/local/include/opencv4/opencv2/core/opencl/runtime/opencl_core_wrappers.hpp
-- Installing: /usr/local/include/opencv4/opencv2/core/opencl/runtime/opencl_gl.hpp
-- Installing: /usr/local/include/opencv4/opencv2/core/opencl/runtime/opencl_gl_wrappers.hpp
-- Installing: /usr/local/include/opencv4/opencv2/core/opencl/runtime/opencl_svm_20.hpp
-- Installing: /usr/local/include/opencv4/opencv2/core/opencl/runtime/opencl_svm_definitions.hpp
-- Installing: /usr/local/include/opencv4/opencv2/core/opencl/runtime/opencl_svm_hsa_extension.hpp
-- Installing: /usr/local/include/opencv4/opencv2/core/cuda/block.hpp
-- Installing: /usr/local/include/opencv4/opencv2/core/cuda/border_interpolate.hpp
-- Installing: /usr/local/include/opencv4/opencv2/core/cuda/color.hpp
-- Installing: /usr/local/include/opencv4/opencv2/core/cuda/common.hpp
-- Installing: /usr/local/include/opencv4/opencv2/core/cuda/datamov_utils.hpp
-- Installing: /usr/local/include/opencv4/opencv2/core/cuda/dynamic_smem.hpp
-- Installing: /usr/local/include/opencv4/opencv2/core/cuda/emulation.hpp
-- Installing: /usr/local/include/opencv4/opencv2/core/cuda/filters.hpp
-- Installing: /usr/local/include/opencv4/opencv2/core/cuda/funcattrib.hpp
-- Installing: /usr/local/include/opencv4/opencv2/core/cuda/functional.hpp
-- Installing: /usr/local/include/opencv4/opencv2/core/cuda/limits.hpp
-- Installing: /usr/local/include/opencv4/opencv2/core/cuda/reduce.hpp
-- Installing: /usr/local/include/opencv4/opencv2/core/cuda/saturate_cast.hpp
-- Installing: /usr/local/include/opencv4/opencv2/core/cuda/scan.hpp
-- Installing: /usr/local/include/opencv4/opencv2/core/cuda/simd_functions.hpp
-- Installing: /usr/local/include/opencv4/opencv2/core/cuda/transform.hpp
-- Installing: /usr/local/include/opencv4/opencv2/core/cuda/type_traits.hpp
-- Installing: /usr/local/include/opencv4/opencv2/core/cuda/utility.hpp
-- Installing: /usr/local/include/opencv4/opencv2/core/cuda/vec_distance.hpp
-- Installing: /usr/local/include/opencv4/opencv2/core/cuda/vec_math.hpp
-- Installing: /usr/local/include/opencv4/opencv2/core/cuda/vec_traits.hpp
-- Installing: /usr/local/include/opencv4/opencv2/core/cuda/warp.hpp
-- Installing: /usr/local/include/opencv4/opencv2/core/cuda/warp_reduce.hpp
-- Installing: /usr/local/include/opencv4/opencv2/core/cuda/warp_shuffle.hpp
-- Installing: /usr/local/include/opencv4/opencv2/core/cuda/detail/color_detail.hpp
-- Installing: /usr/local/include/opencv4/opencv2/core/cuda/detail/reduce.hpp
-- Installing: /usr/local/include/opencv4/opencv2/core/cuda/detail/reduce_key_val.hpp
-- Installing: /usr/local/include/opencv4/opencv2/core/cuda/detail/transform_detail.hpp
-- Installing: /usr/local/include/opencv4/opencv2/core/cuda/detail/type_traits_detail.hpp
-- Installing: /usr/local/include/opencv4/opencv2/core/cuda/detail/vec_distance_detail.hpp
-- Installing: /usr/local/include/opencv4/opencv2/core.hpp
-- Installing: /usr/local/include/opencv4/opencv2/core/affine.hpp
-- Installing: /usr/local/include/opencv4/opencv2/core/base.hpp
-- Installing: /usr/local/include/opencv4/opencv2/core/bindings_utils.hpp
-- Installing: /usr/local/include/opencv4/opencv2/core/bufferpool.hpp
-- Installing: /usr/local/include/opencv4/opencv2/core/check.hpp
-- Installing: /usr/local/include/opencv4/opencv2/core/core.hpp
-- Installing: /usr/local/include/opencv4/opencv2/core/cuda.hpp
-- Installing: /usr/local/include/opencv4/opencv2/core/cuda.inl.hpp
-- Installing: /usr/local/include/opencv4/opencv2/core/cuda_stream_accessor.hpp
-- Installing: /usr/local/include/opencv4/opencv2/core/cuda_types.hpp
-- Installing: /usr/local/include/opencv4/opencv2/core/cvstd.hpp
-- Installing: /usr/local/include/opencv4/opencv2/core/cvstd.inl.hpp
-- Installing: /usr/local/include/opencv4/opencv2/core/cvstd_wrapper.hpp
-- Installing: /usr/local/include/opencv4/opencv2/core/directx.hpp
-- Installing: /usr/local/include/opencv4/opencv2/core/eigen.hpp
-- Installing: /usr/local/include/opencv4/opencv2/core/fast_math.hpp
-- Installing: /usr/local/include/opencv4/opencv2/core/mat.hpp
-- Installing: /usr/local/include/opencv4/opencv2/core/mat.inl.hpp
-- Installing: /usr/local/include/opencv4/opencv2/core/matx.hpp
-- Installing: /usr/local/include/opencv4/opencv2/core/neon_utils.hpp
-- Installing: /usr/local/include/opencv4/opencv2/core/ocl.hpp
-- Installing: /usr/local/include/opencv4/opencv2/core/ocl_genbase.hpp
-- Installing: /usr/local/include/opencv4/opencv2/core/opengl.hpp
-- Installing: /usr/local/include/opencv4/opencv2/core/operations.hpp
-- Installing: /usr/local/include/opencv4/opencv2/core/optim.hpp
-- Installing: /usr/local/include/opencv4/opencv2/core/ovx.hpp
-- Installing: /usr/local/include/opencv4/opencv2/core/persistence.hpp
-- Installing: /usr/local/include/opencv4/opencv2/core/saturate.hpp
-- Installing: /usr/local/include/opencv4/opencv2/core/softfloat.hpp
-- Installing: /usr/local/include/opencv4/opencv2/core/sse_utils.hpp
-- Installing: /usr/local/include/opencv4/opencv2/core/traits.hpp
-- Installing: /usr/local/include/opencv4/opencv2/core/types.hpp
-- Installing: /usr/local/include/opencv4/opencv2/core/utility.hpp
-- Installing: /usr/local/include/opencv4/opencv2/core/va_intel.hpp
-- Installing: /usr/local/include/opencv4/opencv2/core/version.hpp
-- Installing: /usr/local/include/opencv4/opencv2/core/vsx_utils.hpp
-- Installing: /usr/local/include/opencv4/opencv2/core/core_c.h
-- Installing: /usr/local/include/opencv4/opencv2/core/cv_cpu_dispatch.h
-- Installing: /usr/local/include/opencv4/opencv2/core/cv_cpu_helper.h
-- Installing: /usr/local/include/opencv4/opencv2/core/cvdef.h
-- Installing: /usr/local/include/opencv4/opencv2/core/types_c.h
-- Installing: /usr/local/include/opencv4/opencv2/core/hal/hal.hpp
-- Installing: /usr/local/include/opencv4/opencv2/core/hal/intrin.hpp
-- Installing: /usr/local/include/opencv4/opencv2/core/hal/intrin_avx.hpp
-- Installing: /usr/local/include/opencv4/opencv2/core/hal/intrin_cpp.hpp
-- Installing: /usr/local/include/opencv4/opencv2/core/hal/intrin_forward.hpp
-- Installing: /usr/local/include/opencv4/opencv2/core/hal/intrin_neon.hpp
-- Installing: /usr/local/include/opencv4/opencv2/core/hal/intrin_sse.hpp
-- Installing: /usr/local/include/opencv4/opencv2/core/hal/intrin_sse_em.hpp
-- Installing: /usr/local/include/opencv4/opencv2/core/hal/intrin_vsx.hpp
-- Installing: /usr/local/include/opencv4/opencv2/core/hal/interface.h
-- Installing: /usr/local/include/opencv4/opencv2/core/utils/filesystem.hpp
-- Installing: /usr/local/include/opencv4/opencv2/core/utils/logger.defines.hpp
-- Installing: /usr/local/include/opencv4/opencv2/core/utils/logger.hpp
-- Installing: /usr/local/include/opencv4/opencv2/core/utils/trace.hpp
-- Installing: /usr/local/share/licenses/opencv4/SoftFloat-COPYING.txt
-- Installing: /usr/local/lib/libopencv_flann.so.4.0.0
-- Installing: /usr/local/lib/libopencv_flann.so.4.0
-- Set runtime path of "/usr/local/lib/libopencv_flann.so.4.0.0" to "/usr/local/lib"
-- Installing: /usr/local/lib/libopencv_flann.so
-- Installing: /usr/local/include/opencv4/opencv2/flann.hpp
-- Installing: /usr/local/include/opencv4/opencv2/flann/flann.hpp
-- Installing: /usr/local/include/opencv4/opencv2/flann/flann_base.hpp
-- Installing: /usr/local/include/opencv4/opencv2/flann/miniflann.hpp
-- Installing: /usr/local/include/opencv4/opencv2/flann/all_indices.h
-- Installing: /usr/local/include/opencv4/opencv2/flann/allocator.h
-- Installing: /usr/local/include/opencv4/opencv2/flann/any.h
-- Installing: /usr/local/include/opencv4/opencv2/flann/autotuned_index.h
-- Installing: /usr/local/include/opencv4/opencv2/flann/composite_index.h
-- Installing: /usr/local/include/opencv4/opencv2/flann/config.h
-- Installing: /usr/local/include/opencv4/opencv2/flann/defines.h
-- Installing: /usr/local/include/opencv4/opencv2/flann/dist.h
-- Installing: /usr/local/include/opencv4/opencv2/flann/dummy.h
-- Installing: /usr/local/include/opencv4/opencv2/flann/dynamic_bitset.h
-- Installing: /usr/local/include/opencv4/opencv2/flann/general.h
-- Installing: /usr/local/include/opencv4/opencv2/flann/ground_truth.h
-- Installing: /usr/local/include/opencv4/opencv2/flann/heap.h
-- Installing: /usr/local/include/opencv4/opencv2/flann/hierarchical_clustering_index.h
-- Installing: /usr/local/include/opencv4/opencv2/flann/index_testing.h
-- Installing: /usr/local/include/opencv4/opencv2/flann/kdtree_index.h
-- Installing: /usr/local/include/opencv4/opencv2/flann/kdtree_single_index.h
-- Installing: /usr/local/include/opencv4/opencv2/flann/kmeans_index.h
-- Installing: /usr/local/include/opencv4/opencv2/flann/linear_index.h
-- Installing: /usr/local/include/opencv4/opencv2/flann/logger.h
-- Installing: /usr/local/include/opencv4/opencv2/flann/lsh_index.h
-- Installing: /usr/local/include/opencv4/opencv2/flann/lsh_table.h
-- Installing: /usr/local/include/opencv4/opencv2/flann/matrix.h
-- Installing: /usr/local/include/opencv4/opencv2/flann/nn_index.h
-- Installing: /usr/local/include/opencv4/opencv2/flann/object_factory.h
-- Installing: /usr/local/include/opencv4/opencv2/flann/params.h
-- Installing: /usr/local/include/opencv4/opencv2/flann/random.h
-- Installing: /usr/local/include/opencv4/opencv2/flann/result_set.h
-- Installing: /usr/local/include/opencv4/opencv2/flann/sampling.h
-- Installing: /usr/local/include/opencv4/opencv2/flann/saving.h
-- Installing: /usr/local/include/opencv4/opencv2/flann/simplex_downhill.h
-- Installing: /usr/local/include/opencv4/opencv2/flann/timer.h
-- Installing: /usr/local/lib/libopencv_imgproc.so.4.0.0
-- Installing: /usr/local/lib/libopencv_imgproc.so.4.0
-- Set runtime path of "/usr/local/lib/libopencv_imgproc.so.4.0.0" to "/usr/local/lib"
-- Installing: /usr/local/lib/libopencv_imgproc.so
-- Installing: /usr/local/include/opencv4/opencv2/imgproc.hpp
-- Installing: /usr/local/include/opencv4/opencv2/imgproc/imgproc.hpp
-- Installing: /usr/local/include/opencv4/opencv2/imgproc/imgproc_c.h
-- Installing: /usr/local/include/opencv4/opencv2/imgproc/types_c.h
-- Installing: /usr/local/include/opencv4/opencv2/imgproc/hal/hal.hpp
-- Installing: /usr/local/include/opencv4/opencv2/imgproc/hal/interface.h
-- Installing: /usr/local/include/opencv4/opencv2/imgproc/detail/gcgraph.hpp
-- Installing: /usr/local/lib/libopencv_ml.so.4.0.0
-- Installing: /usr/local/lib/libopencv_ml.so.4.0
-- Set runtime path of "/usr/local/lib/libopencv_ml.so.4.0.0" to "/usr/local/lib"
-- Installing: /usr/local/lib/libopencv_ml.so
-- Installing: /usr/local/include/opencv4/opencv2/ml.hpp
-- Installing: /usr/local/include/opencv4/opencv2/ml/ml.hpp
-- Installing: /usr/local/include/opencv4/opencv2/ml/ml.inl.hpp
-- Installing: /usr/local/lib/libopencv_photo.so.4.0.0
-- Installing: /usr/local/lib/libopencv_photo.so.4.0
-- Set runtime path of "/usr/local/lib/libopencv_photo.so.4.0.0" to "/usr/local/lib"
-- Installing: /usr/local/lib/libopencv_photo.so
-- Installing: /usr/local/include/opencv4/opencv2/photo.hpp
-- Installing: /usr/local/include/opencv4/opencv2/photo/cuda.hpp
-- Installing: /usr/local/include/opencv4/opencv2/photo/photo.hpp
-- Installing: /usr/local/lib/libopencv_dnn.so.4.0.0
-- Installing: /usr/local/lib/libopencv_dnn.so.4.0
-- Set runtime path of "/usr/local/lib/libopencv_dnn.so.4.0.0" to "/usr/local/lib"
-- Installing: /usr/local/lib/libopencv_dnn.so
-- Installing: /usr/local/include/opencv4/opencv2/dnn.hpp
-- Installing: /usr/local/include/opencv4/opencv2/dnn/all_layers.hpp
-- Installing: /usr/local/include/opencv4/opencv2/dnn/dict.hpp
-- Installing: /usr/local/include/opencv4/opencv2/dnn/dnn.hpp
-- Installing: /usr/local/include/opencv4/opencv2/dnn/dnn.inl.hpp
-- Installing: /usr/local/include/opencv4/opencv2/dnn/layer.details.hpp
-- Installing: /usr/local/include/opencv4/opencv2/dnn/layer.hpp
-- Installing: /usr/local/include/opencv4/opencv2/dnn/shape_utils.hpp
-- Installing: /usr/local/include/opencv4/opencv2/dnn/version.hpp
-- Installing: /usr/local/lib/libopencv_features2d.so.4.0.0
-- Installing: /usr/local/lib/libopencv_features2d.so.4.0
-- Set runtime path of "/usr/local/lib/libopencv_features2d.so.4.0.0" to "/usr/local/lib"
-- Installing: /usr/local/lib/libopencv_features2d.so
-- Installing: /usr/local/include/opencv4/opencv2/features2d.hpp
-- Installing: /usr/local/include/opencv4/opencv2/features2d/features2d.hpp
-- Installing: /usr/local/include/opencv4/opencv2/features2d/hal/interface.h
-- Installing: /usr/local/lib/libopencv_gapi.so.4.0.0
-- Installing: /usr/local/lib/libopencv_gapi.so.4.0
-- Set runtime path of "/usr/local/lib/libopencv_gapi.so.4.0.0" to "/usr/local/lib"
-- Installing: /usr/local/lib/libopencv_gapi.so
-- Installing: /usr/local/include/opencv4/opencv2/gapi.hpp
-- Installing: /usr/local/include/opencv4/opencv2/gapi/core.hpp
-- Installing: /usr/local/include/opencv4/opencv2/gapi/garg.hpp
-- Installing: /usr/local/include/opencv4/opencv2/gapi/garray.hpp
-- Installing: /usr/local/include/opencv4/opencv2/gapi/gcall.hpp
-- Installing: /usr/local/include/opencv4/opencv2/gapi/gcommon.hpp
-- Installing: /usr/local/include/opencv4/opencv2/gapi/gcompiled.hpp
-- Installing: /usr/local/include/opencv4/opencv2/gapi/gcompoundkernel.hpp
-- Installing: /usr/local/include/opencv4/opencv2/gapi/gcomputation.hpp
-- Installing: /usr/local/include/opencv4/opencv2/gapi/gkernel.hpp
-- Installing: /usr/local/include/opencv4/opencv2/gapi/gmat.hpp
-- Installing: /usr/local/include/opencv4/opencv2/gapi/gmetaarg.hpp
-- Installing: /usr/local/include/opencv4/opencv2/gapi/gproto.hpp
-- Installing: /usr/local/include/opencv4/opencv2/gapi/gscalar.hpp
-- Installing: /usr/local/include/opencv4/opencv2/gapi/gtype_traits.hpp
-- Installing: /usr/local/include/opencv4/opencv2/gapi/gtyped.hpp
-- Installing: /usr/local/include/opencv4/opencv2/gapi/imgproc.hpp
-- Installing: /usr/local/include/opencv4/opencv2/gapi/opencv_includes.hpp
-- Installing: /usr/local/include/opencv4/opencv2/gapi/operators.hpp
-- Installing: /usr/local/include/opencv4/opencv2/gapi/util/any.hpp
-- Installing: /usr/local/include/opencv4/opencv2/gapi/util/compiler_hints.hpp
-- Installing: /usr/local/include/opencv4/opencv2/gapi/util/optional.hpp
-- Installing: /usr/local/include/opencv4/opencv2/gapi/util/throw.hpp
-- Installing: /usr/local/include/opencv4/opencv2/gapi/util/util.hpp
-- Installing: /usr/local/include/opencv4/opencv2/gapi/util/variant.hpp
-- Installing: /usr/local/include/opencv4/opencv2/gapi/cpu/core.hpp
-- Installing: /usr/local/include/opencv4/opencv2/gapi/cpu/gcpukernel.hpp
-- Installing: /usr/local/include/opencv4/opencv2/gapi/cpu/imgproc.hpp
-- Installing: /usr/local/include/opencv4/opencv2/gapi/gpu/core.hpp
-- Installing: /usr/local/include/opencv4/opencv2/gapi/gpu/ggpukernel.hpp
-- Installing: /usr/local/include/opencv4/opencv2/gapi/gpu/imgproc.hpp
-- Installing: /usr/local/include/opencv4/opencv2/gapi/fluid/core.hpp
-- Installing: /usr/local/include/opencv4/opencv2/gapi/fluid/gfluidbuffer.hpp
-- Installing: /usr/local/include/opencv4/opencv2/gapi/fluid/gfluidkernel.hpp
-- Installing: /usr/local/include/opencv4/opencv2/gapi/fluid/imgproc.hpp
-- Installing: /usr/local/include/opencv4/opencv2/gapi/own/assert.hpp
-- Installing: /usr/local/include/opencv4/opencv2/gapi/own/convert.hpp
-- Installing: /usr/local/include/opencv4/opencv2/gapi/own/cvdefs.hpp
-- Installing: /usr/local/include/opencv4/opencv2/gapi/own/exports.hpp
-- Installing: /usr/local/include/opencv4/opencv2/gapi/own/mat.hpp
-- Installing: /usr/local/include/opencv4/opencv2/gapi/own/saturate.hpp
-- Installing: /usr/local/include/opencv4/opencv2/gapi/own/scalar.hpp
-- Installing: /usr/local/include/opencv4/opencv2/gapi/own/types.hpp
-- Installing: /usr/local/lib/libopencv_calib3d.so.4.0.0
-- Installing: /usr/local/lib/libopencv_calib3d.so.4.0
-- Set runtime path of "/usr/local/lib/libopencv_calib3d.so.4.0.0" to "/usr/local/lib"
-- Installing: /usr/local/lib/libopencv_calib3d.so
-- Installing: /usr/local/include/opencv4/opencv2/calib3d.hpp
-- Installing: /usr/local/include/opencv4/opencv2/calib3d/calib3d.hpp
-- Installing: /usr/local/include/opencv4/opencv2/calib3d/calib3d_c.h
-- Installing: /usr/local/lib/libopencv_objdetect.so.4.0.0
-- Installing: /usr/local/lib/libopencv_objdetect.so.4.0
-- Set runtime path of "/usr/local/lib/libopencv_objdetect.so.4.0.0" to "/usr/local/lib"
-- Installing: /usr/local/lib/libopencv_objdetect.so
-- Installing: /usr/local/include/opencv4/opencv2/objdetect.hpp
-- Installing: /usr/local/include/opencv4/opencv2/objdetect/detection_based_tracker.hpp
-- Installing: /usr/local/include/opencv4/opencv2/objdetect/objdetect.hpp
-- Installing: /usr/local/lib/libopencv_stitching.so.4.0.0
-- Installing: /usr/local/lib/libopencv_stitching.so.4.0
-- Set runtime path of "/usr/local/lib/libopencv_stitching.so.4.0.0" to "/usr/local/lib"
-- Installing: /usr/local/lib/libopencv_stitching.so
-- Installing: /usr/local/include/opencv4/opencv2/stitching.hpp
-- Installing: /usr/local/include/opencv4/opencv2/stitching/warpers.hpp
-- Installing: /usr/local/include/opencv4/opencv2/stitching/detail/autocalib.hpp
-- Installing: /usr/local/include/opencv4/opencv2/stitching/detail/blenders.hpp
-- Installing: /usr/local/include/opencv4/opencv2/stitching/detail/camera.hpp
-- Installing: /usr/local/include/opencv4/opencv2/stitching/detail/exposure_compensate.hpp
-- Installing: /usr/local/include/opencv4/opencv2/stitching/detail/matchers.hpp
-- Installing: /usr/local/include/opencv4/opencv2/stitching/detail/motion_estimators.hpp
-- Installing: /usr/local/include/opencv4/opencv2/stitching/detail/seam_finders.hpp
-- Installing: /usr/local/include/opencv4/opencv2/stitching/detail/timelapsers.hpp
-- Installing: /usr/local/include/opencv4/opencv2/stitching/detail/util.hpp
-- Installing: /usr/local/include/opencv4/opencv2/stitching/detail/util_inl.hpp
-- Installing: /usr/local/include/opencv4/opencv2/stitching/detail/warpers.hpp
-- Installing: /usr/local/include/opencv4/opencv2/stitching/detail/warpers_inl.hpp
-- Installing: /usr/local/lib/libopencv_video.so.4.0.0
-- Installing: /usr/local/lib/libopencv_video.so.4.0
-- Set runtime path of "/usr/local/lib/libopencv_video.so.4.0.0" to "/usr/local/lib"
-- Installing: /usr/local/lib/libopencv_video.so
-- Installing: /usr/local/include/opencv4/opencv2/video.hpp
-- Installing: /usr/local/include/opencv4/opencv2/video/background_segm.hpp
-- Installing: /usr/local/include/opencv4/opencv2/video/tracking.hpp
-- Installing: /usr/local/include/opencv4/opencv2/video/video.hpp
-- Installing: /usr/local/share/opencv4/haarcascades/haarcascade_eye.xml
-- Installing: /usr/local/share/opencv4/haarcascades/haarcascade_eye_tree_eyeglasses.xml
-- Installing: /usr/local/share/opencv4/haarcascades/haarcascade_frontalcatface.xml
-- Installing: /usr/local/share/opencv4/haarcascades/haarcascade_frontalcatface_extended.xml
-- Installing: /usr/local/share/opencv4/haarcascades/haarcascade_frontalface_alt.xml
-- Installing: /usr/local/share/opencv4/haarcascades/haarcascade_frontalface_alt2.xml
-- Installing: /usr/local/share/opencv4/haarcascades/haarcascade_frontalface_alt_tree.xml
-- Installing: /usr/local/share/opencv4/haarcascades/haarcascade_frontalface_default.xml
-- Installing: /usr/local/share/opencv4/haarcascades/haarcascade_fullbody.xml
-- Installing: /usr/local/share/opencv4/haarcascades/haarcascade_lefteye_2splits.xml
-- Installing: /usr/local/share/opencv4/haarcascades/haarcascade_licence_plate_rus_16stages.xml
-- Installing: /usr/local/share/opencv4/haarcascades/haarcascade_lowerbody.xml
-- Installing: /usr/local/share/opencv4/haarcascades/haarcascade_profileface.xml
-- Installing: /usr/local/share/opencv4/haarcascades/haarcascade_righteye_2splits.xml
-- Installing: /usr/local/share/opencv4/haarcascades/haarcascade_russian_plate_number.xml
-- Installing: /usr/local/share/opencv4/haarcascades/haarcascade_smile.xml
-- Installing: /usr/local/share/opencv4/haarcascades/haarcascade_upperbody.xml
-- Installing: /usr/local/share/opencv4/lbpcascades/lbpcascade_frontalcatface.xml
-- Installing: /usr/local/share/opencv4/lbpcascades/lbpcascade_frontalface.xml
-- Installing: /usr/local/share/opencv4/lbpcascades/lbpcascade_frontalface_improved.xml
-- Installing: /usr/local/share/opencv4/lbpcascades/lbpcascade_profileface.xml
-- Installing: /usr/local/share/opencv4/lbpcascades/lbpcascade_silverware.xml
-- Installing: /usr/local/bin/opencv_version
-- Set runtime path of "/usr/local/bin/opencv_version" to "/usr/local/lib"
#


now to compile Darknet-YOLO with the opencv flag turned on and head towards real time object detection tests with Puppy Linux Bionic 18.05+17 (peebee)
Back to top
View user's profile Send private message Visit poster's website 
rockedge


Joined: 11 Apr 2012
Posts: 1005
Location: Connecticut, United States

PostPosted: Tue 20 Nov 2018, 17:43    Post subject:  

Also was able to build it with a woof-CE built upupbb18.05 with a kernel 4.14.rt37 real time optimized.

test of opencv 4.0.0-dev on the Bionic 18.05+17 peebee's 32 bit version using a kernel 4.18.16 ->
Screenshot(1).png
 Description   
 Filesize   27.07 KB
 Viewed   233 Time(s)

Screenshot(1).png

Back to top
View user's profile Send private message Visit poster's website 
Mike Walsh


Joined: 28 Jun 2014
Posts: 4741
Location: King's Lynn, UK.

PostPosted: Tue 20 Nov 2018, 19:56    Post subject:  

@ rockedge:-

I have no idea whether this might be of any use to you or not, but Norgo built an SFS package for the 2.3 Community Version of Cinelerra a while back, in the Cinelerra thread:-

http://www.murga-linux.com/puppy/viewtopic.php?t=91418

The reason I mention it is because it was apparently built with Opencv.....and has a shed-load of libopencv stuff contained within. May be of interest to you, maybe it won't. If you are curious, I've a copy of it here:-

http://www.mediafire.com/file/utut76ixdtf458i/CinelerraCV-2.3-i686.sfs/file

It's not a huge download; only 23 MB. Up to you, of course....


Mike. Wink

_________________
My 'Puppy' Packages
--------------------------------------

Back to top
View user's profile Send private message Visit poster's website 
rockedge


Joined: 11 Apr 2012
Posts: 1005
Location: Connecticut, United States

PostPosted: Tue 20 Nov 2018, 21:31    Post subject:  

Thank you Mike! I am downloading the file and will look it over shortly
Back to top
View user's profile Send private message Visit poster's website 
rockedge


Joined: 11 Apr 2012
Posts: 1005
Location: Connecticut, United States

PostPosted: Tue 20 Nov 2018, 21:49    Post subject:  

I installed it on Bionic 18.05+17 but needed to find Libpng14.so14.pet made for Puppy Linux 3.01 to supply the Libpng14.so14 Cinelerra needs to run.
Screenshot(5).png
 Description   
 Filesize   206.38 KB
 Viewed   209 Time(s)

Screenshot(5).png

Back to top
View user's profile Send private message Visit poster's website 
ITSMERSH

Joined: 02 May 2018
Posts: 911

PostPosted: Tue 20 Nov 2018, 22:12    Post subject:  

Hi.

Needed to make a symbolic link

- libx264.so.138 to libx264.so.142

and to grab

- libdv.so.4
- libdv.so.4.0.3

from my Kdenlive SFS Module to get it running in my Art Studio (not comparable to a plain Tahr Puppy).
Screenshot-2018-11-21-03-06-20.jpg
 Description   
 Filesize   93.28 KB
 Viewed   208 Time(s)

Screenshot-2018-11-21-03-06-20.jpg


_________________
RSH

Beware of the Dog ähem nic007! Wink
Back to top
View user's profile Send private message 
Display posts from previous:   Sort by:   
Page 1 of 1 [8 Posts]  
Post new topic   Reply to topic View previous topic :: View next topic
 Forum index » Advanced Topics » Additional Software (PETs, n' stuff) » Multimedia
Jump to:  

You cannot post new topics in this forum
You cannot reply to topics in this forum
You cannot edit your posts in this forum
You cannot delete your posts in this forum
You cannot vote in polls in this forum
You cannot attach files in this forum
You can download files in this forum


Powered by phpBB © 2001, 2005 phpBB Group
[ Time: 0.0904s ][ Queries: 13 (0.0039s) ][ GZIP on ]