Puppy Linux Discussion Forum Forum Index Puppy Linux Discussion Forum
Puppy HOME page : puppylinux.com
"THE" alternative forum : puppylinux.info
 
 FAQFAQ   SearchSearch   MemberlistMemberlist   UsergroupsUsergroups   RegisterRegister 
 ProfileProfile   Log in to check your private messagesLog in to check your private messages   Log inLog in 

The time now is Tue 30 Sep 2014, 16:16
All times are UTC - 4
 Forum index » House Training » Users ( For the regulars )
trouble compiling gxine
Moderators: Flash, Ian, JohnMurga
Post new topic   Reply to topic View previous topic :: View next topic
Page 1 of 1 [1 Post]  
Author Message
GuestToday
Guest


PostPosted: Wed 30 Nov 2005, 16:26    Post subject:  trouble compiling gxine  

Trying to compile gxine 0.5.1 in puppy 1.0.7 (with usr_devx):
First compiled xine-lib-1.1.1 (no problems encountered).
Added /usr/local/lib to /etc/ld.so.conf
exec ldconfig
exec export LD_LIBRARY_PATH=/usr/local/lib:$LD_LIBRARY_PATH
gxine configure failed with "libjs not found"
based on googled solution, added:
ln -s /usr/include/mozilla-1.8b1.5/js /usr/include/js
ln -s /usr/lib/mozilla-1.8b1.5/libmozjs.so /usr/lib/libjs.so
gxine configure completed
make install abends at key_events.c:

gcc -DHAVE_CONFIG_H -I. -I. -I../include -I../include -I../include -I/usr/local/include -I../pixmaps -std=gnu99 -I/usr/local/include -DXTHREADS -D_REENTRANT -DXUSE_MTSAFE_API -I/usr/include/gtk-2.0 -I/usr/lib/gtk-2.0/include -I/usr/X11R6/include -I/usr/include/atk-1.0 -I/usr/include/pango-1.0 -I/usr/include/freetype2 -I/usr/include/freetype2/config -I/usr/include/glib-2.0 -I/usr/lib/glib-2.0/include -pthread -I/usr/include/glib-2.0 -I/usr/lib/glib-2.0/include -I/usr/include/js -DLOCALEDIR=\"/usr/local/share/locale\" -c `test -f 'key_events.c' || echo './'`key_events.c
key_events.c: In function `save_key_bindings':
key_events.c:434: warning: implicit declaration of function `xml_escape_string'
key_events.c:434: error: `XML_ESCAPE_NO_QUOTE' undeclared (first use in this function)
key_events.c:434: error: (Each undeclared identifier is reported only once
key_events.c:434: error: for each function it appears in.)
key_events.c:434: warning: initialization makes pointer from integer without a cast
key_events.c:435: warning: initialization makes pointer from integer without a cast
key_events.c: In function `key_events_init':
key_events.c:1279: warning: initialization from incompatible pointer type
key_events.c:1280: warning: initialization from incompatible pointer type
key_events.c:1281: warning: initialization from incompatible pointer type
key_events.c:1282: warning: initialization from incompatible pointer type
key_events.c:1283: warning: initialization from incompatible pointer type
key_events.c:1284: warning: initialization from incompatible pointer type
key_events.c:1285: warning: initialization from incompatible pointer type
make[1]: *** [key_events.o] Error 1
make[1]: Leaving directory `/root/gxine-0.5.1/src'
make: *** [install-recursive] Error 1

any ideas about what is happening? Thanks!
Back to top
Display posts from previous:   Sort by:   
Page 1 of 1 [1 Post]  
Post new topic   Reply to topic View previous topic :: View next topic
 Forum index » House Training » Users ( For the regulars )
Jump to:  

You cannot post new topics in this forum
You cannot reply to topics in this forum
You cannot edit your posts in this forum
You cannot delete your posts in this forum
You cannot vote in polls in this forum
You cannot attach files in this forum
You can download files in this forum


Powered by phpBB © 2001, 2005 phpBB Group
[ Time: 0.0388s ][ Queries: 11 (0.0039s) ][ GZIP on ]