Puppy Linux Discussion Forum Forum Index Puppy Linux Discussion Forum
Puppy HOME page : puppylinux.com
"THE" alternative forum : puppylinux.info
 
 FAQFAQ   SearchSearch   MemberlistMemberlist   UsergroupsUsergroups   RegisterRegister 
 ProfileProfile   Log in to check your private messagesLog in to check your private messages   Log inLog in 

The time now is Fri 18 Apr 2014, 15:27
All times are UTC - 4
 Forum index » Advanced Topics » Puppy Derivatives
Dinamite Puppy[primordial state] .01% complete help wanted
Moderators: Flash, JohnMurga
Post new topic   Reply to topic View previous topic :: View next topic
Page 1 of 1 [5 Posts]  
Author Message
cb88


Joined: 28 Jan 2007
Posts: 1169
Location: USA

PostPosted: Mon 25 Jun 2007, 12:18    Post subject:  Dinamite Puppy[primordial state] .01% complete help wanted  

these are the files I have so far
Puppy-kernel-source_216.sfs
sched-cfs-v2.6.21.5-v18.patch
linux-2.6.21.5.tar.bz2
devx_216.sfs

Goals:
set up hard drive install extract devx_2.16.sfs to hard drive?
compile kernel
compile modules?
what do i do here to make a live cd? aufs how? what about pup_save.sfs?
apply cfs pactch recompile everything
long term--fbui make it fallback instead of command line (maybe very difficult).
long term--openmosix
extremely small--16-32MB
xvesa only no Xorg(at first might need it for dvd playback one of my goals)

My first Kernel ever"."(say the period)
I intend to compile a basic kernel first.
instructions tips welcolme I have read the compiling puppy page
progress reports to follow.
Back to top
View user's profile Send private message Visit poster's website 
Lobster
Official Crustacean


Joined: 04 May 2005
Posts: 15117
Location: Paradox Realm

PostPosted: Mon 25 Jun 2007, 13:38    Post subject:  

This script has just been announced - you could use and test perhaps Smile
http://www.murga-linux.com/puppy/viewtopic.php?p=124517#124517

good luck

_________________
Puppy WIKI
Back to top
View user's profile Send private message Visit poster's website 
cb88


Joined: 28 Jan 2007
Posts: 1169
Location: USA

PostPosted: Mon 25 Jun 2007, 20:40    Post subject:  

I have installed puppy on my hard drive grubloader loads vmlinuz but where is initrd in a hard drive install?

if I build a cutdown puppy with a build script could I just update vmlinuz and /lib/modules or is there a lot more to updating the kernel?
Back to top
View user's profile Send private message Visit poster's website 
cb88


Joined: 28 Jan 2007
Posts: 1169
Location: USA

PostPosted: Tue 26 Jun 2007, 09:44    Post subject:  

got this error trying to compile 2.6.21.5 kernel
used the old config from puppy 2.16 (possible cause of problems)
extracted source to /usr/src/linuxxxxx/



sh-3.00# ls
arch crypto include kernel mm scripts
block Documentation init lib net security
COPYING drivers ipc MAINTAINERS README sound
CREDITS fs Kbuild Makefile REPORTING-BUGS usr
sh-3.00# make clean
makesh-3.00# make mrproper
CLEAN .config
sh-3.00# make menuconfig
HOSTCC scripts/basic/fixdep
scripts/basic/fixdep.c:107:23: sys/types.h: No such file or directory
scripts/basic/fixdep.c:108:22: sys/stat.h: No such file or directory
scripts/basic/fixdep.c:109:22: sys/mman.h: No such file or directory
scripts/basic/fixdep.c:110:20: unistd.h: No such file or directory
scripts/basic/fixdep.c:111:19: fcntl.h: No such file or directory
scripts/basic/fixdep.c:112:20: string.h: No such file or directory
scripts/basic/fixdep.c:113:20: stdlib.h: No such file or directory
scripts/basic/fixdep.c:114:19: stdio.h: No such file or directory
In file included from /usr/lib/gcc/i486-t2-linux-gnu/3.4.4/include/syslimits.h:7,
from /usr/lib/gcc/i486-t2-linux-gnu/3.4.4/include/limits.h:11,
from scripts/basic/fixdep.c:115:
/usr/lib/gcc/i486-t2-linux-gnu/3.4.4/include/limits.h:122:61: limits.h: No such file or directory
scripts/basic/fixdep.c:116:19: ctype.h: No such file or directory
scripts/basic/fixdep.c:117:23: arpa/inet.h: No such file or directory
scripts/basic/fixdep.c: In function `usage':
scripts/basic/fixdep.c:131: warning: implicit declaration of function `fprintf'
scripts/basic/fixdep.c:131: error: `stderr' undeclared (first use in this function)
scripts/basic/fixdep.c:131: error: (Each undeclared identifier is reported only once
scripts/basic/fixdep.c:131: error: for each function it appears in.)
scripts/basic/fixdep.c:132: warning: implicit declaration of function `exit'
scripts/basic/fixdep.c: In function `print_cmdline':
scripts/basic/fixdep.c:140: warning: implicit declaration of function `printf'
scripts/basic/fixdep.c: At top level:
scripts/basic/fixdep.c:143: error: `NULL' undeclared here (not in a function)
scripts/basic/fixdep.c: In function `grow_config':
scripts/basic/fixdep.c:156: warning: implicit declaration of function `realloc'
scripts/basic/fixdep.c:156: warning: assignment makes pointer from integer without a cast
scripts/basic/fixdep.c:158: warning: implicit declaration of function `perror'
scripts/basic/fixdep.c: In function `is_defined_config':
scripts/basic/fixdep.c:174: warning: implicit declaration of function `memcmp'
scripts/basic/fixdep.c: In function `define_config':
scripts/basic/fixdep.c:187: warning: implicit declaration of function `memcpy'
scripts/basic/fixdep.c: In function `use_config':
scripts/basic/fixdep.c:206: error: `PATH_MAX' undeclared (first use in this function)
scripts/basic/fixdep.c:220: warning: implicit declaration of function `tolower'
scripts/basic/fixdep.c:206: warning: unused variable `s'
scripts/basic/fixdep.c: At top level:
scripts/basic/fixdep.c:225: error: parse error before "size_t"
scripts/basic/fixdep.c:226: warning: function declaration isn't a prototype
scripts/basic/fixdep.c: In function `parse_config_file':
scripts/basic/fixdep.c:227: error: `map' undeclared (first use in this function)
scripts/basic/fixdep.c:227: error: `len' undeclared (first use in this function)
scripts/basic/fixdep.c:233: warning: implicit declaration of function `ntohl'
scripts/basic/fixdep.c:244: warning: implicit declaration of function `isalnum'
scripts/basic/fixdep.c: In function `strrcmp':
scripts/basic/fixdep.c:261: warning: implicit declaration of function `strlen'
scripts/basic/fixdep.c: In function `do_config_file':
scripts/basic/fixdep.c:272: error: storage size of 'st' isn't known
scripts/basic/fixdep.c:276: warning: implicit declaration of function `open'
scripts/basic/fixdep.c:276: error: `O_RDONLY' undeclared (first use in this function)
scripts/basic/fixdep.c:278: error: `stderr' undeclared (first use in this function)
scripts/basic/fixdep.c:282: warning: implicit declaration of function `fstat'
scripts/basic/fixdep.c:284: warning: implicit declaration of function `close'
scripts/basic/fixdep.c:287: warning: implicit declaration of function `mmap'
scripts/basic/fixdep.c:287: error: `PROT_READ' undeclared (first use in this function)
scripts/basic/fixdep.c:287: error: `MAP_PRIVATE' undeclared (first use in this function)
scripts/basic/fixdep.c:287: warning: assignment makes pointer from integer without a cast
scripts/basic/fixdep.c:296: warning: implicit declaration of function `munmap'
scripts/basic/fixdep.c:272: warning: unused variable `st'
scripts/basic/fixdep.c: At top level:
scripts/basic/fixdep.c:301: error: parse error before "size_t"
scripts/basic/fixdep.c:302: warning: function declaration isn't a prototype
scripts/basic/fixdep.c: In function `parse_dep_file':
scripts/basic/fixdep.c:303: error: `map' undeclared (first use in this function)
scripts/basic/fixdep.c:304: error: `len' undeclared (first use in this function)
scripts/basic/fixdep.c:306: error: `PATH_MAX' undeclared (first use in this function)
scripts/basic/fixdep.c:308: warning: implicit declaration of function `strchr'
scripts/basic/fixdep.c:310: error: `stderr' undeclared (first use in this function)
scripts/basic/fixdep.c:306: warning: unused variable `s'
scripts/basic/fixdep.c: In function `print_deps':
scripts/basic/fixdep.c:343: error: storage size of 'st' isn't known
scripts/basic/fixdep.c:347: error: `O_RDONLY' undeclared (first use in this function)
scripts/basic/fixdep.c:349: error: `stderr' undeclared (first use in this function)
scripts/basic/fixdep.c:359: error: `PROT_READ' undeclared (first use in this function)
scripts/basic/fixdep.c:359: error: `MAP_PRIVATE' undeclared (first use in this function)
scripts/basic/fixdep.c:359: warning: assignment makes pointer from integer without a cast
scripts/basic/fixdep.c:343: warning: unused variable `st'
scripts/basic/fixdep.c: In function `traps':
scripts/basic/fixdep.c:378: error: `stderr' undeclared (first use in this function)
make[1]: *** [scripts/basic/fixdep] Error 1
make: *** [scripts_basic] Error 2
sh-3.00# make bzimage
HOSTCC scripts/basic/fixdep
scripts/basic/fixdep.c:107:23: sys/types.h: No such file or directory
scripts/basic/fixdep.c:108:22: sys/stat.h: No such file or directory
scripts/basic/fixdep.c:109:22: sys/mman.h: No such file or directory
scripts/basic/fixdep.c:110:20: unistd.h: No such file or directory
scripts/basic/fixdep.c:111:19: fcntl.h: No such file or directory
scripts/basic/fixdep.c:112:20: string.h: No such file or directory
scripts/basic/fixdep.c:113:20: stdlib.h: No such file or directory
scripts/basic/fixdep.c:114:19: stdio.h: No such file or directory
In file included from /usr/lib/gcc/i486-t2-linux-gnu/3.4.4/include/syslimits.h:7,
from /usr/lib/gcc/i486-t2-linux-gnu/3.4.4/include/limits.h:11,
from scripts/basic/fixdep.c:115:
/usr/lib/gcc/i486-t2-linux-gnu/3.4.4/include/limits.h:122:61: limits.h: No such file or directory
scripts/basic/fixdep.c:116:19: ctype.h: No such file or directory
scripts/basic/fixdep.c:117:23: arpa/inet.h: No such file or directory
scripts/basic/fixdep.c: In function `usage':
scripts/basic/fixdep.c:131: warning: implicit declaration of function `fprintf'
scripts/basic/fixdep.c:131: error: `stderr' undeclared (first use in this function)
scripts/basic/fixdep.c:131: error: (Each undeclared identifier is reported only once
scripts/basic/fixdep.c:131: error: for each function it appears in.)
scripts/basic/fixdep.c:132: warning: implicit declaration of function `exit'
scripts/basic/fixdep.c: In function `print_cmdline':
scripts/basic/fixdep.c:140: warning: implicit declaration of function `printf'
scripts/basic/fixdep.c: At top level:
scripts/basic/fixdep.c:143: error: `NULL' undeclared here (not in a function)
scripts/basic/fixdep.c: In function `grow_config':
scripts/basic/fixdep.c:156: warning: implicit declaration of function `realloc'
scripts/basic/fixdep.c:156: warning: assignment makes pointer from integer without a cast
scripts/basic/fixdep.c:158: warning: implicit declaration of function `perror'
scripts/basic/fixdep.c: In function `is_defined_config':
scripts/basic/fixdep.c:174: warning: implicit declaration of function `memcmp'
scripts/basic/fixdep.c: In function `define_config':
scripts/basic/fixdep.c:187: warning: implicit declaration of function `memcpy'
scripts/basic/fixdep.c: In function `use_config':
scripts/basic/fixdep.c:206: error: `PATH_MAX' undeclared (first use in this function)
scripts/basic/fixdep.c:220: warning: implicit declaration of function `tolower'
scripts/basic/fixdep.c:206: warning: unused variable `s'
scripts/basic/fixdep.c: At top level:
scripts/basic/fixdep.c:225: error: parse error before "size_t"
scripts/basic/fixdep.c:226: warning: function declaration isn't a prototype
scripts/basic/fixdep.c: In function `parse_config_file':
scripts/basic/fixdep.c:227: error: `map' undeclared (first use in this function)
scripts/basic/fixdep.c:227: error: `len' undeclared (first use in this function)
scripts/basic/fixdep.c:233: warning: implicit declaration of function `ntohl'
scripts/basic/fixdep.c:244: warning: implicit declaration of function `isalnum'
scripts/basic/fixdep.c: In function `strrcmp':
scripts/basic/fixdep.c:261: warning: implicit declaration of function `strlen'
scripts/basic/fixdep.c: In function `do_config_file':
scripts/basic/fixdep.c:272: error: storage size of 'st' isn't known
scripts/basic/fixdep.c:276: warning: implicit declaration of function `open'
scripts/basic/fixdep.c:276: error: `O_RDONLY' undeclared (first use in this function)
scripts/basic/fixdep.c:278: error: `stderr' undeclared (first use in this function)
scripts/basic/fixdep.c:282: warning: implicit declaration of function `fstat'
scripts/basic/fixdep.c:284: warning: implicit declaration of function `close'
scripts/basic/fixdep.c:287: warning: implicit declaration of function `mmap'
scripts/basic/fixdep.c:287: error: `PROT_READ' undeclared (first use in this function)
scripts/basic/fixdep.c:287: error: `MAP_PRIVATE' undeclared (first use in this function)
scripts/basic/fixdep.c:287: warning: assignment makes pointer from integer without a cast
scripts/basic/fixdep.c:296: warning: implicit declaration of function `munmap'
scripts/basic/fixdep.c:272: warning: unused variable `st'
scripts/basic/fixdep.c: At top level:
scripts/basic/fixdep.c:301: error: parse error before "size_t"
scripts/basic/fixdep.c:302: warning: function declaration isn't a prototype
scripts/basic/fixdep.c: In function `parse_dep_file':
scripts/basic/fixdep.c:303: error: `map' undeclared (first use in this function)
scripts/basic/fixdep.c:304: error: `len' undeclared (first use in this function)
scripts/basic/fixdep.c:306: error: `PATH_MAX' undeclared (first use in this function)
scripts/basic/fixdep.c:308: warning: implicit declaration of function `strchr'
scripts/basic/fixdep.c:310: error: `stderr' undeclared (first use in this function)
scripts/basic/fixdep.c:306: warning: unused variable `s'
scripts/basic/fixdep.c: In function `print_deps':
scripts/basic/fixdep.c:343: error: storage size of 'st' isn't known
scripts/basic/fixdep.c:347: error: `O_RDONLY' undeclared (first use in this function)
scripts/basic/fixdep.c:349: error: `stderr' undeclared (first use in this function)
scripts/basic/fixdep.c:359: error: `PROT_READ' undeclared (first use in this function)
scripts/basic/fixdep.c:359: error: `MAP_PRIVATE' undeclared (first use in this function)
scripts/basic/fixdep.c:359: warning: assignment makes pointer from integer without a cast
scripts/basic/fixdep.c:343: warning: unused variable `st'
scripts/basic/fixdep.c: In function `traps':
scripts/basic/fixdep.c:378: error: `stderr' undeclared (first use in this function)
make[2]: *** [scripts/basic/fixdep] Error 1
make[1]: *** [scripts_basic] Error 2
make: *** No rule to make target `bzimage'. Stop.
sh-3.00# make bzImage
HOSTCC scripts/basic/fixdep
scripts/basic/fixdep.c:107:23: sys/types.h: No such file or directory
scripts/basic/fixdep.c:108:22: sys/stat.h: No such file or directory
scripts/basic/fixdep.c:109:22: sys/mman.h: No such file or directory
scripts/basic/fixdep.c:110:20: unistd.h: No such file or directory
scripts/basic/fixdep.c:111:19: fcntl.h: No such file or directory
scripts/basic/fixdep.c:112:20: string.h: No such file or directory
scripts/basic/fixdep.c:113:20: stdlib.h: No such file or directory
scripts/basic/fixdep.c:114:19: stdio.h: No such file or directory
In file included from /usr/lib/gcc/i486-t2-linux-gnu/3.4.4/include/syslimits.h:7,
from /usr/lib/gcc/i486-t2-linux-gnu/3.4.4/include/limits.h:11,
from scripts/basic/fixdep.c:115:
/usr/lib/gcc/i486-t2-linux-gnu/3.4.4/include/limits.h:122:61: limits.h: No such file or directory
scripts/basic/fixdep.c:116:19: ctype.h: No such file or directory
scripts/basic/fixdep.c:117:23: arpa/inet.h: No such file or directory
scripts/basic/fixdep.c: In function `usage':
scripts/basic/fixdep.c:131: warning: implicit declaration of function `fprintf'
scripts/basic/fixdep.c:131: error: `stderr' undeclared (first use in this function)
scripts/basic/fixdep.c:131: error: (Each undeclared identifier is reported only once
scripts/basic/fixdep.c:131: error: for each function it appears in.)
scripts/basic/fixdep.c:132: warning: implicit declaration of function `exit'
scripts/basic/fixdep.c: In function `print_cmdline':
scripts/basic/fixdep.c:140: warning: implicit declaration of function `printf'
scripts/basic/fixdep.c: At top level:
scripts/basic/fixdep.c:143: error: `NULL' undeclared here (not in a function)
scripts/basic/fixdep.c: In function `grow_config':
scripts/basic/fixdep.c:156: warning: implicit declaration of function `realloc'
scripts/basic/fixdep.c:156: warning: assignment makes pointer from integer without a cast
scripts/basic/fixdep.c:158: warning: implicit declaration of function `perror'
scripts/basic/fixdep.c: In function `is_defined_config':
scripts/basic/fixdep.c:174: warning: implicit declaration of function `memcmp'
scripts/basic/fixdep.c: In function `define_config':
scripts/basic/fixdep.c:187: warning: implicit declaration of function `memcpy'
scripts/basic/fixdep.c: In function `use_config':
scripts/basic/fixdep.c:206: error: `PATH_MAX' undeclared (first use in this function)
scripts/basic/fixdep.c:220: warning: implicit declaration of function `tolower'
scripts/basic/fixdep.c:206: warning: unused variable `s'
scripts/basic/fixdep.c: At top level:
scripts/basic/fixdep.c:225: error: parse error before "size_t"
scripts/basic/fixdep.c:226: warning: function declaration isn't a prototype
scripts/basic/fixdep.c: In function `parse_config_file':
scripts/basic/fixdep.c:227: error: `map' undeclared (first use in this function)
scripts/basic/fixdep.c:227: error: `len' undeclared (first use in this function)
scripts/basic/fixdep.c:233: warning: implicit declaration of function `ntohl'
scripts/basic/fixdep.c:244: warning: implicit declaration of function `isalnum'
scripts/basic/fixdep.c: In function `strrcmp':
scripts/basic/fixdep.c:261: warning: implicit declaration of function `strlen'
scripts/basic/fixdep.c: In function `do_config_file':
scripts/basic/fixdep.c:272: error: storage size of 'st' isn't known
scripts/basic/fixdep.c:276: warning: implicit declaration of function `open'
scripts/basic/fixdep.c:276: error: `O_RDONLY' undeclared (first use in this function)
scripts/basic/fixdep.c:278: error: `stderr' undeclared (first use in this function)
scripts/basic/fixdep.c:282: warning: implicit declaration of function `fstat'
scripts/basic/fixdep.c:284: warning: implicit declaration of function `close'
scripts/basic/fixdep.c:287: warning: implicit declaration of function `mmap'
scripts/basic/fixdep.c:287: error: `PROT_READ' undeclared (first use in this function)
scripts/basic/fixdep.c:287: error: `MAP_PRIVATE' undeclared (first use in this function)
scripts/basic/fixdep.c:287: warning: assignment makes pointer from integer without a cast
scripts/basic/fixdep.c:296: warning: implicit declaration of function `munmap'
scripts/basic/fixdep.c:272: warning: unused variable `st'
scripts/basic/fixdep.c: At top level:
scripts/basic/fixdep.c:301: error: parse error before "size_t"
scripts/basic/fixdep.c:302: warning: function declaration isn't a prototype
scripts/basic/fixdep.c: In function `parse_dep_file':
scripts/basic/fixdep.c:303: error: `map' undeclared (first use in this function)
scripts/basic/fixdep.c:304: error: `len' undeclared (first use in this function)
scripts/basic/fixdep.c:306: error: `PATH_MAX' undeclared (first use in this function)
scripts/basic/fixdep.c:308: warning: implicit declaration of function `strchr'
scripts/basic/fixdep.c:310: error: `stderr' undeclared (first use in this function)
scripts/basic/fixdep.c:306: warning: unused variable `s'
scripts/basic/fixdep.c: In function `print_deps':
scripts/basic/fixdep.c:343: error: storage size of 'st' isn't known
scripts/basic/fixdep.c:347: error: `O_RDONLY' undeclared (first use in this function)
scripts/basic/fixdep.c:349: error: `stderr' undeclared (first use in this function)
scripts/basic/fixdep.c:359: error: `PROT_READ' undeclared (first use in this function)
scripts/basic/fixdep.c:359: error: `MAP_PRIVATE' undeclared (first use in this function)
scripts/basic/fixdep.c:359: warning: assignment makes pointer from integer without a cast
scripts/basic/fixdep.c:343: warning: unused variable `st'
scripts/basic/fixdep.c: In function `traps':
scripts/basic/fixdep.c:378: error: `stderr' undeclared (first use in this function)
make[2]: *** [scripts/basic/fixdep] Error 1
make[1]: *** [scripts_basic] Error 2
make: *** No rule to make target `include/config/auto.conf', needed by `include/config/kernel.release'. Stop.
sh-3.00#
Back to top
View user's profile Send private message Visit poster's website 
vw111

Joined: 12 Aug 2007
Posts: 4

PostPosted: Mon 10 Sep 2007, 10:47    Post subject:  

Hi, I 'm wondering if anyone knows the answer to cb88's error, for I've been trying to compile the patched kernel source for 2.15ce to tweak it for my cpu (just for fun, an i686 "gaming puppy") I would gladly like to know, for I'm getting the same error, and can't find a solution anywhere on the net.
Back to top
View user's profile Send private message 
Display posts from previous:   Sort by:   
Page 1 of 1 [5 Posts]  
Post new topic   Reply to topic View previous topic :: View next topic
 Forum index » Advanced Topics » Puppy Derivatives
Jump to:  

You cannot post new topics in this forum
You cannot reply to topics in this forum
You cannot edit your posts in this forum
You cannot delete your posts in this forum
You cannot vote in polls in this forum
You cannot attach files in this forum
You can download files in this forum


Powered by phpBB © 2001, 2005 phpBB Group
[ Time: 0.0907s ][ Queries: 11 (0.0033s) ][ GZIP on ]